Reaction Details
TargetThyroid hormone receptor beta
LigandBDBM50036401
Substrate/Competitorn/a
Meas. Tech.ChEMBL_143914 (CHEMBL872845)
IC50 0.100000±n/a nM
Citation Yokoyama, NWalker, GNMain, AJStanton, JLMorrissey, MMBoehm, CEngle, ANeubert, ADWasvary, JMStephan, ZF Synthesis and structure-activity relationships of oxamic acid and acetic acid derivatives related to L-thyronine. J Med Chem38:695-707 (1995) Thyroid hormone receptor beta
Name:Thyroid hormone receptor beta
Type:Enzyme Catalytic Domain
Mol. Mass.:52661.52
Organism:RAT
Description:thyroid beta 0 RAT::P18113
Residue:461
BDBM50036401
NameBDBM50036401
Synonyms:CHEMBL163221 | N-[4-(4-Hydroxy-3-isopropyl-phenoxy)-3,5-diiodo-phenyl]-oxalamic acid
TypeSmall organic molecule
Emp. Form.C17H15I2NO5
Mol. Mass.567.1136
SMILESCC(C)c1cc(Oc2c(I)cc(NC(=O)C(O)=O)cc2I)ccc1O