Reaction Details
TargetThyroid hormone receptor beta
LigandBDBM50036421
Substrate/Competitorn/a
Meas. Tech.ChEMBL_143914 (CHEMBL872845)
IC50 48±n/a nM
Citation Yokoyama, NWalker, GNMain, AJStanton, JLMorrissey, MMBoehm, CEngle, ANeubert, ADWasvary, JMStephan, ZF Synthesis and structure-activity relationships of oxamic acid and acetic acid derivatives related to L-thyronine. J Med Chem38:695-707 (1995) Thyroid hormone receptor beta
Name:Thyroid hormone receptor beta
Type:Enzyme Catalytic Domain
Mol. Mass.:52661.52
Organism:RAT
Description:thyroid beta 0 RAT::P18113
Residue:461
BDBM50036421
NameBDBM50036421
Synonyms:(S)-2-Amino-3-{3,5-dibromo-4-[4-hydroxy-3-(6-oxo-1,6-dihydro-pyridazin-3-ylmethyl)-phenoxy]-phenyl}-propionic acid CHEMBL163228
TypeSmall organic molecule
Emp. Form.C20H17Br2N3O5
Mol. Mass.539.174
SMILESN[C@@H](Cc1cc(Br)c(Oc2ccc(O)c(Cc3ccc(=O)[nH]n3)c2)c(Br)c1)C(O)=O