Reaction Details
TargetThyroid hormone receptor beta
LigandBDBM50036424
Substrate/Competitorn/a
Meas. Tech.ChEMBL_157265 (CHEMBL765465)
IC50>5000±n/a nM
Citation Yokoyama, NWalker, GNMain, AJStanton, JLMorrissey, MMBoehm, CEngle, ANeubert, ADWasvary, JMStephan, ZF Synthesis and structure-activity relationships of oxamic acid and acetic acid derivatives related to L-thyronine. J Med Chem38:695-707 (1995) Thyroid hormone receptor beta
Name:Thyroid hormone receptor beta
Type:Enzyme Catalytic Domain
Mol. Mass.:52661.52
Organism:RAT
Description:thyroid beta 0 RAT::P18113
Residue:461
BDBM50036424
NameBDBM50036424
Synonyms:CHEMBL159334 | N-{3,5-Dichloro-4-[3-(4-fluoro-benzoyl)-4-hydroxy-phenoxy]-phenyl}-oxalamic acid
TypeSmall organic molecule
Emp. Form.C21H12Cl2FNO6
Mol. Mass.464.227
SMILESOC(=O)C(=O)Nc1cc(Cl)c(Oc2ccc(O)c(c2)C(=O)c2ccc(F)cc2)c(Cl)c1