Reaction Details
TargetThyroid hormone receptor beta
LigandBDBM50036404
Substrate/Competitorn/a
Meas. Tech.ChEMBL_157265 (CHEMBL765465)
IC50>5000±n/a nM
Citation Yokoyama, NWalker, GNMain, AJStanton, JLMorrissey, MMBoehm, CEngle, ANeubert, ADWasvary, JMStephan, ZF Synthesis and structure-activity relationships of oxamic acid and acetic acid derivatives related to L-thyronine. J Med Chem38:695-707 (1995) Thyroid hormone receptor beta
Name:Thyroid hormone receptor beta
Type:Enzyme Catalytic Domain
Mol. Mass.:52661.52
Organism:RAT
Description:thyroid beta 0 RAT::P18113
Residue:461
BDBM50036404
NameBDBM50036404
Synonyms:CHEMBL159595 | N-(4-{3-[(4-Fluoro-phenyl)-hydroxy-methyl]-4-hydroxy-phenoxy}-3,5-dimethyl-phenyl)-oxalamic acid
TypeSmall organic molecule
Emp. Form.C23H20FNO6
Mol. Mass.425.4064
SMILESCc1cc(NC(=O)C(O)=O)cc(C)c1Oc1ccc(O)c(c1)C(O)c1ccc(F)cc1