Reaction Details
TargetThyroid hormone receptor beta
LigandBDBM50036418
Substrate/Competitorn/a
Meas. Tech.ChEMBL_143914 (CHEMBL872845)
IC50 0.23±n/a nM
Citation Yokoyama, NWalker, GNMain, AJStanton, JLMorrissey, MMBoehm, CEngle, ANeubert, ADWasvary, JMStephan, ZF Synthesis and structure-activity relationships of oxamic acid and acetic acid derivatives related to L-thyronine. J Med Chem38:695-707 (1995) Thyroid hormone receptor beta
Name:Thyroid hormone receptor beta
Type:Enzyme Catalytic Domain
Mol. Mass.:52661.52
Organism:RAT
Description:thyroid beta 0 RAT::P18113
Residue:461
BDBM50036418
NameBDBM50036418
Synonyms:CHEMBL350049 | N-[4-(4-Hydroxy-3-isopropyl-phenoxy)-3,5-dimethyl-phenyl]-oxalamic acid ethyl ester
TypeSmall organic molecule
Emp. Form.C21H25NO5
Mol. Mass.371.4269
SMILESCCOC(=O)C(=O)Nc1cc(C)c(Oc2ccc(O)c(c2)C(C)C)c(C)c1