Reaction Details
TargetThyroid hormone receptor beta
LigandBDBM50036419
Substrate/Competitorn/a
Meas. Tech.ChEMBL_143914 (CHEMBL872845)
IC50 120±n/a nM
Citation Yokoyama, NWalker, GNMain, AJStanton, JLMorrissey, MMBoehm, CEngle, ANeubert, ADWasvary, JMStephan, ZF Synthesis and structure-activity relationships of oxamic acid and acetic acid derivatives related to L-thyronine. J Med Chem38:695-707 (1995) Thyroid hormone receptor beta
Name:Thyroid hormone receptor beta
Type:Enzyme Catalytic Domain
Mol. Mass.:52661.52
Organism:RAT
Description:thyroid beta 0 RAT::P18113
Residue:461
BDBM50036419
NameBDBM50036419
Synonyms:CHEMBL163805 | N-[4-(4-Hydroxy-3-isopropyl-phenoxy)-3,5-dimethyl-phenyl]-N-methyl-oxalamic acid
TypeSmall organic molecule
Emp. Form.C20H23NO5
Mol. Mass.357.4003
SMILESCC(C)c1cc(Oc2c(C)cc(cc2C)N(C)C(=O)C(O)=O)ccc1O