Reaction Details
TargetThyroid hormone receptor beta
LigandBDBM50036420
Substrate/Competitorn/a
Meas. Tech.ChEMBL_143914 (CHEMBL872845)
IC50 1±n/a nM
Citation Yokoyama, NWalker, GNMain, AJStanton, JLMorrissey, MMBoehm, CEngle, ANeubert, ADWasvary, JMStephan, ZF Synthesis and structure-activity relationships of oxamic acid and acetic acid derivatives related to L-thyronine. J Med Chem38:695-707 (1995) Thyroid hormone receptor beta
Name:Thyroid hormone receptor beta
Type:Enzyme Catalytic Domain
Mol. Mass.:52661.52
Organism:RAT
Description:thyroid beta 0 RAT::P18113
Residue:461
BDBM50036420
NameBDBM50036420
Synonyms:CHEMBL161535 | N-[4-(3-Isopropyl-4-methoxy-phenoxy)-3,5-dimethyl-phenyl]-oxalamic acid methyl ester
TypeSmall organic molecule
Emp. Form.C21H25NO5
Mol. Mass.371.4269
SMILESCOC(=O)C(=O)Nc1cc(C)c(Oc2ccc(OC)c(c2)C(C)C)c(C)c1