Reaction Details
TargetThyroid hormone receptor beta
LigandBDBM50036425
Substrate/Competitorn/a
Meas. Tech.ChEMBL_143915 (CHEMBL752718)
IC50 58±n/a nM
Citation Yokoyama, NWalker, GNMain, AJStanton, JLMorrissey, MMBoehm, CEngle, ANeubert, ADWasvary, JMStephan, ZF Synthesis and structure-activity relationships of oxamic acid and acetic acid derivatives related to L-thyronine. J Med Chem38:695-707 (1995) Thyroid hormone receptor beta
Name:Thyroid hormone receptor beta
Type:Enzyme Catalytic Domain
Mol. Mass.:52661.52
Organism:RAT
Description:thyroid beta 0 RAT::P18113
Residue:461
BDBM50036425
NameBDBM50036425
Synonyms:2-[3,5-Dichloro-4-(4-hydroxy-3-isopropyl-phenoxy)-phenylamino]-3-phenyl-propionic acid | CHEMBL160203
TypeSmall organic molecule
Emp. Form.C24H23Cl2NO4
Mol. Mass.460.35
SMILESCC(C)c1cc(Oc2c(Cl)cc(NC(Cc3ccccc3)C(O)=O)cc2Cl)ccc1O