Reaction Details
TargetThyroid hormone receptor beta
LigandBDBM50036428
Substrate/Competitorn/a
Meas. Tech.ChEMBL_143914 (CHEMBL872845)
IC50 52±n/a nM
Citation Yokoyama, NWalker, GNMain, AJStanton, JLMorrissey, MMBoehm, CEngle, ANeubert, ADWasvary, JMStephan, ZF Synthesis and structure-activity relationships of oxamic acid and acetic acid derivatives related to L-thyronine. J Med Chem38:695-707 (1995) Thyroid hormone receptor beta
Name:Thyroid hormone receptor beta
Type:Enzyme Catalytic Domain
Mol. Mass.:52661.52
Organism:RAT
Description:thyroid beta 0 RAT::P18113
Residue:461
BDBM50036428
NameBDBM50036428
Synonyms:CHEMBL163518 | N-{3,5-Dichloro-4-[3-(4-chloro-benzoyl)-4-hydroxy-phenoxy]-phenyl}-oxalamic acid
TypeSmall organic molecule
Emp. Form.C21H12Cl3NO6
Mol. Mass.480.682
SMILESOC(=O)C(=O)Nc1cc(Cl)c(Oc2ccc(O)c(c2)C(=O)c2ccc(Cl)cc2)c(Cl)c1