Reaction Details
Target5-hydroxytryptamine receptor 2C
LigandBDBM50028598
Substrate/Competitorn/a
Meas. Tech.ChEMBL_2814 (CHEMBL617843)
Ki 6±n/a nM
Citation Phillips, STde Paulis, TNeergaard, JRBaron, BMSiegel, BWSeeman, PVan Tol, HHGuan, HCSmith, HE Binding of 5H-dibenzo[a,d]cycloheptene and dibenz[b,f]oxepin analogues of clozapine to dopamine and serotonin receptors. J Med Chem38:708-14 (1995) 5-hydroxytryptamine receptor 2C
Name:5-hydroxytryptamine receptor 2C
Type:Enzyme
Mol. Mass.:51935.10
Organism:Rattus norvegicus (Rat)
Description:P08909
Residue:460
BDBM50028598
NameBDBM50028598
Synonyms:1-Dibenzo[b,f]oxepin-10-yl-4-methyl-piperazine | CHEMBL89970
TypeSmall organic molecule
Emp. Form.C19H20N2O
Mol. Mass.292.3749
SMILESCN1CCN(CC1)C1=Cc2ccccc2Oc2ccccc12