Reaction Details
TargetDihydrofolate reductase
LigandBDBM50036487
Substrate/Competitorn/a
Meas. Tech.ChEMBL_54287 (CHEMBL666806)
Ki 49±n/a nM
Citation Rosowsky, AMota, CEQueener, SFWaltham, MErcikan-Abali, EBertino, JR 2,4-Diamino-5-substituted-quinazolines as inhibitors of a human dihydrofolate reductase with a site-directed mutation at position 22 and of the dihydrofolate reductases from Pneumocystis carinii and Toxoplasma gondii. J Med Chem38:745-52 (1995) Dihydrofolate reductase
Name:Dihydrofolate reductase
Type:Enzyme
Mol. Mass.:21453.99
Organism:Homo sapiens (Human)
Description:Recombinant human DHFR.
Residue:187
BDBM50036487
NameBDBM50036487
Synonyms:5-{[Methyl-(3,4,5-trimethoxy-phenyl)-amino]-methyl}-quinazoline-2,4-diamine | CHEMBL162270
TypeSmall organic molecule
Emp. Form.C19H23N5O3
Mol. Mass.369.4176
SMILESCOc1cc(cc(OC)c1OC)N(C)Cc1cccc2nc(N)nc(N)c12