Reaction Details
TargetDihydrofolate reductase
LigandBDBM50036491
Substrate/Competitorn/a
Meas. Tech.ChEMBL_54287 (CHEMBL666806)
Ki 4.2±n/a nM
Citation Rosowsky, AMota, CEQueener, SFWaltham, MErcikan-Abali, EBertino, JR 2,4-Diamino-5-substituted-quinazolines as inhibitors of a human dihydrofolate reductase with a site-directed mutation at position 22 and of the dihydrofolate reductases from Pneumocystis carinii and Toxoplasma gondii. J Med Chem38:745-52 (1995) Dihydrofolate reductase
Name:Dihydrofolate reductase
Type:Enzyme
Mol. Mass.:21453.99
Organism:Homo sapiens (Human)
Description:Recombinant human DHFR.
Residue:187
BDBM50036491
NameBDBM50036491
Synonyms:5-[2-(2,5-Dimethoxy-phenyl)-ethyl]-quinazoline-2,4-diamine | CHEMBL349149
TypeSmall organic molecule
Emp. Form.C18H20N4O2
Mol. Mass.324.377
SMILESCOc1ccc(OC)c(CCc2cccc3nc(N)nc(N)c23)c1