Reaction Details
TargetDNA topoisomerase 1
LigandBDBM50034013
Substrate/Competitorn/a
Meas. Tech.ChEMBL_53721 (CHEMBL663649)
IC50 28±n/a nM
Citation Uehling, DENanthakumar, SSCroom, DEmerson, DLLeitner, PPLuzzio, MJMcIntyre, GMorton, BProfeta, SSisco, J Synthesis, topoisomerase I inhibitory activity, and in vivo evaluation of 11-azacamptothecin analogs. J Med Chem38:1106-18 (1995) DNA topoisomerase 1
Name:DNA topoisomerase 1
Type:Enzyme
Mol. Mass.:90771.02
Organism:Homo sapiens (Human)
Description:P11387
Residue:765
BDBM50034013
NameBDBM50034013
Synonyms:(S)-9-Bromo-4-ethyl-4-hydroxy-11-methyl-1,12-dihydro-4H-2-oxa-6,8,12a-triaza-dibenzo[b,h]fluorene-3,13-dione CHEMBL13935
TypeSmall organic molecule
Emp. Form.C20H16BrN3O4
Mol. Mass.442.263
SMILESCC[C@@]1(O)C(=O)OCc2c1cc1-c3nc4cnc(Br)cc4c(C)c3Cn1c2=O