Reaction Details
TargetDNA topoisomerase 1
LigandBDBM50034020
Substrate/Competitorn/a
Meas. Tech.ChEMBL_53722 (CHEMBL663650)
IC50 190±n/a nM
Citation Uehling, DENanthakumar, SSCroom, DEmerson, DLLeitner, PPLuzzio, MJMcIntyre, GMorton, BProfeta, SSisco, J Synthesis, topoisomerase I inhibitory activity, and in vivo evaluation of 11-azacamptothecin analogs. J Med Chem38:1106-18 (1995) DNA topoisomerase 1
Name:DNA topoisomerase 1
Type:Enzyme
Mol. Mass.:90771.02
Organism:Homo sapiens (Human)
Description:P11387
Residue:765
BDBM50034020
NameBDBM50034020
Synonyms:(S)-9-Aminomethyl-4-ethyl-4-hydroxy-11-methyl-8-oxy-1,12-dihydro-4H-2-oxa-6,8,12a-triaza-dibenzo[b,h]fluorene-3,13-dione | CHEMBL275134
TypeSmall organic molecule
Emp. Form.C21H20N4O5
Mol. Mass.408.4073
SMILESCC[C@@]1(O)C(=O)OCc2c1cc1-c3nc4c[n+]([O-])c(CN)cc4c(C)c3Cn1c2=O