Reaction Details
Target5-hydroxytryptamine receptor 2A
LigandBDBM50004327
Substrate/Competitorn/a
Meas. Tech.ChEMBL_2613 (CHEMBL617481)
Ki 2.5±n/a nM
Citation Ismaiel, AMArruda, KTeitler, MGlennon, RA Ketanserin analogues: the effect of structural modification on 5-HT2 serotonin receptor binding. J Med Chem38:1196-202 (1995) 5-hydroxytryptamine receptor 2A
Name:5-hydroxytryptamine receptor 2A
Type:G Protein-Coupled Receptor (GPCR)
Mol. Mass.:52852.05
Organism:Rattus norvegicus (rat)
Description:Rat cortex membranes 5-HT2A receptors.
Residue:471
BDBM50004327
NameBDBM50004327
Synonyms:(1-Phenethyl-piperidin-4-yl)-phenyl-methanol Glemanserin MDL-11939
TypeSmall organic molecule
Emp. Form.C20H25NO
Mol. Mass.295.4186
SMILESOC(C1CCN(CCc2ccccc2)CC1)c1ccccc1