Reaction Details
TargetMetabotropic glutamate receptor 2
LigandBDBM50007548
Substrate/Competitorn/a
Meas. Tech.ChEMBL_106064 (CHEMBL718229)
EC50>1000000±n/a nM
Citation Knöpfel, TKuhn, RAllgeier, H Metabotropic glutamate receptors: novel targets for drug development. J Med Chem38:1417-26 (1995) Metabotropic glutamate receptor 2
Name:Metabotropic glutamate receptor 2
Type:Enzyme
Mol. Mass.:95584.88
Organism:Homo sapiens (Human)
Description:Q14416
Residue:872
BDBM50007548
NameBDBM50007548
Synonyms:(S)-2-Amino-4-phosphono-butyric acid 2-Amino-3-(3,5-dioxo-[1,2,4]oxadiazolidin-2-yl)-propionic acid 2-Amino-4-phosphono-butyric acid(S-AP4) 2-amino-4-phosphonobutyric acid L-(+)-2-amino-4-phosphonobutyric acid L-AP4 | L-APB
TypeSmall organic molecule
Emp. Form.C4H10NO5P
Mol. Mass.183.0997
SMILESN[C@@H](CCP(O)(O)=O)C(O)=O