Reaction Details
TargetMetabotropic glutamate receptor 4
LigandBDBM50034503
Substrate/Competitorn/a
Meas. Tech.ChEMBL_106690 (CHEMBL714671)
EC50>1000000±n/a nM
Citation Knöpfel, TKuhn, RAllgeier, H Metabotropic glutamate receptors: novel targets for drug development. J Med Chem38:1417-26 (1995) Metabotropic glutamate receptor 4
Name:Metabotropic glutamate receptor 4
Type:Enzyme
Mol. Mass.:101849.79
Organism:Rattus norvegicus (Rat)
Description:P31423
Residue:912
BDBM50034503
NameBDBM50034503
Synonyms:(1R,2R)-3-((S)-Amino-carboxy-methyl)-cyclopropane-1,2-dicarboxylic acid (2S,2'R,3'R)-2-(2',3')-dicarboxycyclopropylglycine CHEMBL284193 | DCG-IV
TypeSmall organic molecule
Emp. Form.C7H9NO6
Mol. Mass.203.1495
SMILESN[C@@H](C1[C@H]([C@@H]1C(O)=O)C(O)=O)C(O)=O