Reaction Details
TargetAdenosine receptor A2a
LigandBDBM50085658
Substrate/Competitorn/a
Meas. Tech.ChEMBL_30898 (CHEMBL875015)
EC50>10±n/a nM
Citation Cristalli, GCamaioni, EVittori, SVolpini, RBorea, PAConti, ADionisotti, SOngini, EMonopoli, A 2-Aralkynyl and 2-heteroalkynyl derivatives of adenosine-5'-N-ethyluronamide as selective A2a adenosine receptor agonists. J Med Chem38:1462-72 (1995) Adenosine receptor A2a
Name:Adenosine receptor A2a
Type:G Protein-Coupled Receptor (GPCR)
Mol. Mass.:45015.65
Organism:Rattus norvegicus (rat)
Description:Rat A2A receptors expressed in CHO cells.
Residue:410
BDBM50085658
NameBDBM50085658
Synonyms:(2R,3R,4S,5R)-2-(2-Chloro-6-cyclopentylamino-purin-9-yl)-5-hydroxymethyl-tetrahydro-furan-3,4-diol 2-(2-Chloro-6-cyclopentylamino-purin-9-yl)-5-hydroxymethyl-tetrahydro-furan-3,4-diol 2-Cl-CPA 5-(2-Chloro-6-cyclopentylamino-purin-9-yl)-tetrahydro-furan-2,3,4-triol CHEMBL284969 | N6-Cyclopentyl-2-chloroAdo
TypeSmall organic molecule
Emp. Form.C15H20ClN5O4
Mol. Mass.369.803
SMILESOC[C@H]1O[C@H]([C@H](O)[C@@H]1O)n1cnc2c(NC3CCCC3)nc(Cl)nc12