Reaction Details
TargetAdenosine receptor A1
LigandBDBM50453346
Substrate/Competitorn/a
Meas. Tech.ChEMBL_28394 (CHEMBL636813)
EC50 167±n/a nM
Citation Cristalli, GCamaioni, EVittori, SVolpini, RBorea, PAConti, ADionisotti, SOngini, EMonopoli, A 2-Aralkynyl and 2-heteroalkynyl derivatives of adenosine-5'-N-ethyluronamide as selective A2a adenosine receptor agonists. J Med Chem38:1462-72 (1995) Adenosine receptor A1
Name:Adenosine receptor A1
Type:Protein
Mol. Mass.:36704.13
Organism:Rattus norvegicus (rat)
Description:n/a
Residue:326
BDBM50453346
NameBDBM50453346
Synonyms:CHEMBL2113449
TypeSmall organic molecule
Emp. Form.C14H16N6O4
Mol. Mass.332.3146
SMILESCCNC(=O)[C@H]1O[C@H]([C@H](O)[C@@H]1O)n1cnc2c(N)nc(nc12)C#C