Reaction Details
TargetAdenosine receptor A2a
LigandBDBM50369099
Substrate/Competitorn/a
Meas. Tech.ChEMBL_30919 (CHEMBL647729)
Ki 7±n/a nM
Citation Cristalli, GCamaioni, EVittori, SVolpini, RBorea, PAConti, ADionisotti, SOngini, EMonopoli, A 2-Aralkynyl and 2-heteroalkynyl derivatives of adenosine-5'-N-ethyluronamide as selective A2a adenosine receptor agonists. J Med Chem38:1462-72 (1995) Adenosine receptor A2a
Name:Adenosine receptor A2a
Type:G Protein-Coupled Receptor (GPCR)
Mol. Mass.:45015.65
Organism:Rattus norvegicus (rat)
Description:Rat A2A receptors expressed in CHO cells.
Residue:410
BDBM50369099
NameBDBM50369099
Synonyms:CHEMBL605690
TypeSmall organic molecule
Emp. Form.C22H24N6O4
Mol. Mass.436.4638
SMILESCCNC(=O)[C@H]1OC([C@H](O)[C@@H]1O)n1cnc2c(N)nc(nc12)C#CCCc1ccccc1