Reaction Details
TargetAdenosine receptor A2a
LigandBDBM50369084
Substrate/Competitorn/a
Meas. Tech.ChEMBL_30919 (CHEMBL647729)
Ki 27±n/a nM
Citation Cristalli, GCamaioni, EVittori, SVolpini, RBorea, PAConti, ADionisotti, SOngini, EMonopoli, A 2-Aralkynyl and 2-heteroalkynyl derivatives of adenosine-5'-N-ethyluronamide as selective A2a adenosine receptor agonists. J Med Chem38:1462-72 (1995) Adenosine receptor A2a
Name:Adenosine receptor A2a
Type:G Protein-Coupled Receptor (GPCR)
Mol. Mass.:45015.65
Organism:Rattus norvegicus (rat)
Description:Rat A2A receptors expressed in CHO cells.
Residue:410
BDBM50369084
NameBDBM50369084
Synonyms:CHEMBL604440
TypeSmall organic molecule
Emp. Form.C19H25N7O5
Mol. Mass.431.4457
SMILESCCNC(=O)[C@H]1OC([C@H](O)[C@@H]1O)n1cnc2c(N)nc(nc12)C#CCN1CCOCC1