Reaction Details
TargetAdenosine receptor A1
LigandBDBM50369092
Substrate/Competitorn/a
Meas. Tech.ChEMBL_28988 (CHEMBL636766)
Ki 900±n/a nM
Citation Cristalli, GCamaioni, EVittori, SVolpini, RBorea, PAConti, ADionisotti, SOngini, EMonopoli, A 2-Aralkynyl and 2-heteroalkynyl derivatives of adenosine-5'-N-ethyluronamide as selective A2a adenosine receptor agonists. J Med Chem38:1462-72 (1995) Adenosine receptor A1
Name:Adenosine receptor A1
Type:Protein
Mol. Mass.:36704.13
Organism:Rattus norvegicus (rat)
Description:n/a
Residue:326
BDBM50369092
NameBDBM50369092
Synonyms:CHEMBL604234
TypeSmall organic molecule
Emp. Form.C20H19N7O6
Mol. Mass.453.4082
SMILESCCNC(=O)[C@H]1OC([C@H](O)[C@@H]1O)n1cnc2c(N)nc(nc12)C#Cc1ccc(cc1)[N+]([O-])=O