Reaction Details
TargetAdenosine receptor A2a
LigandBDBM50369107
Substrate/Competitorn/a
Meas. Tech.ChEMBL_30898 (CHEMBL875015)
EC50 110±n/a nM
Citation Cristalli, GCamaioni, EVittori, SVolpini, RBorea, PAConti, ADionisotti, SOngini, EMonopoli, A 2-Aralkynyl and 2-heteroalkynyl derivatives of adenosine-5'-N-ethyluronamide as selective A2a adenosine receptor agonists. J Med Chem38:1462-72 (1995) Adenosine receptor A2a
Name:Adenosine receptor A2a
Type:G Protein-Coupled Receptor (GPCR)
Mol. Mass.:45015.65
Organism:Rattus norvegicus (rat)
Description:Rat A2A receptors expressed in CHO cells.
Residue:410
BDBM50369107
NameBDBM50369107
Synonyms:CHEMBL603596
TypeSmall organic molecule
Emp. Form.C21H20N6O5
Mol. Mass.436.4207
SMILESCCNC(=O)[C@H]1OC([C@H](O)[C@@H]1O)n1cnc2c(N)nc(nc12)C#Cc1ccc(C=O)cc1