Reaction Details
TargetKappa-type opioid receptor
LigandBDBM50454092
Substrate/Competitorn/a
Meas. Tech.ChEMBL_146508 (CHEMBL754617)
Ki>0.500000±n/a nM
Citation Brine, GAStark, PALiu, YCarroll, FISingh, PXu, HRothman, RB Enantiomers of diastereomeric cis-N-[1-(2-hydroxy-2-phenylethyl)- 3-methyl-4-piperidyl]-N-phenylpropanamides: synthesis, X-ray analysis, and biological activities. J Med Chem38:1547-57 (1995) Kappa-type opioid receptor
Name:Kappa-type opioid receptor
Type:G Protein-Coupled Receptor (GPCR)
Mol. Mass.:42744.99
Organism:Cavia porcellus (domestic guinea pig)
Description:P41144
Residue:380
BDBM50454092
NameBDBM50454092
Synonyms:CHEMBL2373185
TypeSmall organic molecule
Emp. Form.C23H31ClN2O2
Mol. Mass.402.957
SMILESCl.CCC(=O)N([C@H]1CCN(C[C@@H](O)c2ccccc2)C[C@H]1C)c1ccccc1