Reaction Details
TargetDelta-type opioid receptor
LigandBDBM50033536
Substrate/Competitorn/a
Meas. Tech.ChEMBL_147031 (CHEMBL753672)
Ki 148±n/a nM
Citation Brine, GAStark, PALiu, YCarroll, FISingh, PXu, HRothman, RB Enantiomers of diastereomeric cis-N-[1-(2-hydroxy-2-phenylethyl)- 3-methyl-4-piperidyl]-N-phenylpropanamides: synthesis, X-ray analysis, and biological activities. J Med Chem38:1547-57 (1995) Delta-type opioid receptor
Name:Delta-type opioid receptor
Type:G Protein-Coupled Receptor (GPCR)
Mol. Mass.:40465.04
Organism:Rattus norvegicus (rat)
Description:Competition binding assays were using CHO-K1 cell membranes expressing the opioid receptor.
Residue:372
BDBM50033536
NameBDBM50033536
Synonyms:CHEMBL121494 | N-[(3R,4R)-1-((R)-2-Hydroxy-2-phenyl-ethyl)-3-methyl-piperidin-4-yl]-N-phenyl-propionamide
TypeSmall organic molecule
Emp. Form.C23H30N2O2
Mol. Mass.366.4965
SMILESCCC(=O)N([C@@H]1CCN(C[C@H](O)c2ccccc2)C[C@H]1C)c1ccccc1