Reaction Details
TargetPhosphodiesterase
LigandBDBM50049054
Substrate/Competitorn/a
Meas. Tech.ChEMBL_156456 (CHEMBL764834)
IC50 3000±n/a nM
Citation Nomoto, YTakai, HOhno, TNagashima, KYao, KYamada, KKubo, KIchimura, MMihara, AKase, H Studies of cardiotonic agents. 8. Synthesis and biological activities of optically active 6-(4-(benzylamino)-7-quinazolinyl)-4,5-dihydro-5-methyl-3(2H)- pyridazinone (KF15232). J Med Chem39:297-303 (1996) 
 
Phosphodiesterase
Name:Phosphodiesterase
Type:PROTEIN
Mol. Mass.:124301.20
Organism:Bos taurus
Description:ChEMBL_156453
Residue:1115
BDBM50049054
NameBDBM50049054
Synonyms:(S)-6-(4-Benzylamino-quinazolin-7-yl)-5-methyl-4,5-dihydro-2H-pyridazin-3-one | CHEMBL102807
TypeSmall organic molecule
Emp. Form.C20H19N5O
Mol. Mass.345.3978
SMILESC[C@H]1CC(=O)NN=C1c1ccc2c(NCc3ccccc3)ncnc2c1