Reaction Details
TargetMu-type opioid receptor
LigandBDBM50367123
Substrate/Competitorn/a
Meas. Tech.ChEMBL_148550 (CHEMBL755352)
IC50 0.14±n/a nM
Citation Bertha, CMEllis, MFlippen-Anderson, JLPorreca, FRothman, RBDavis, PXu, HBecketts, KRice, KC Probes for narcotic receptor-mediated phenomena. 21. Novel derivatives of 3-(1,2,3,4,5,11-hexahydro-3-methyl-2,6-methano-6H-azocino[4,5-b]indol- 6-yl)-phenols with improved delta opioid receptor selectivity. J Med Chem39:2081-6 (1996) 
 
Mu-type opioid receptor
Name:Mu-type opioid receptor
Type:G Protein-Coupled Receptor (GPCR)
Mol. Mass.:44503.11
Organism:Rattus norvegicus (rat)
Description:Competition binding assays were carried out using membrane preparations from transfected HN9.10 cells that constitutively expressed the mu opioid receptor.
Residue:398
BDBM50367123
NameBDBM50367123
Synonyms:ETORPHINE | M99
TypeSmall organic molecule
Emp. Form.C24H31NO4
Mol. Mass.397.5072
SMILESCCC[C@](C)(O)[C@H]1C[C@]23C=C[C@]1(O)[C@@H]1Oc4c5c(C[C@H]2N(C)CC[C@@]315)ccc4O