Reaction Details
TargetDipeptidyl peptidase 4
LigandBDBM50369128
Substrate/Competitorn/a
Meas. Tech.ChEMBL_53379 (CHEMBL665783)
IC50 25±n/a nM
Citation Coutts, SJKelly, TASnow, RJKennedy, CABarton, RWAdams, JKrolikowski, DAFreeman, DMCampbell, SJKsiazek, JFBachovchin, WW Structure-activity relationships of boronic acid inhibitors of dipeptidyl peptidase IV. 1. Variation of the P2 position of Xaa-boroPro dipeptides. J Med Chem39:2087-94 (1996) 
 
Dipeptidyl peptidase 4
Name:Dipeptidyl peptidase 4
Type:Enzyme
Mol. Mass.:88271.01
Organism:Homo sapiens (Human)
Description:P27487
Residue:766
BDBM50369128
NameBDBM50369128
Synonyms:CHEMBL1790483 US11559537, Compound 4316
TypeSmall organic molecule
Emp. Form.C10H21BN2O3
Mol. Mass.228.096
SMILESCC[C@H](C)[C@H](N)C(=O)N1CCC[C@H]1B(O)O