Reaction Details
TargetReverse transcriptase/RNaseH
LigandBDBM50050814
Substrate/Competitorn/a
Meas. Tech.ChEMBL_195535 (CHEMBL800982)
IC50 5±n/a nM
Citation Silverman, BDPlatt, DE Comparative molecular moment analysis (CoMMA): 3D-QSAR without molecular superposition. J Med Chem39:2129-40 (1996) 
 
Reverse transcriptase/RNaseH
Name:Reverse transcriptase/RNaseH
Type:PROTEIN
Mol. Mass.:65229.15
Organism:Human immunodeficiency virus 1
Description:ChEMBL_1473730
Residue:566
BDBM50050814
NameBDBM50050814
Synonyms:5-Chloro-8-methyl-7-(3-methyl-but-2-enyl)-6,7,8,9-tetrahydro-2H-2,7,9a-triaza-benzo[cd]azulene-1-thione tivirapine
TypeSmall organic molecule
Emp. Form.C16H20ClN3S
Mol. Mass.321.868
SMILESCC1Cn2c3c(CN1CC=C(C)C)c(Cl)ccc3[nH]c2=S