Reaction Details
TargetReverse transcriptase/RNaseH
LigandBDBM50036550
Substrate/Competitorn/a
Meas. Tech.ChEMBL_195535 (CHEMBL800982)
IC50 12600±n/a nM
Citation Silverman, BDPlatt, DE Comparative molecular moment analysis (CoMMA): 3D-QSAR without molecular superposition. J Med Chem39:2129-40 (1996) 
 
Reverse transcriptase/RNaseH
Name:Reverse transcriptase/RNaseH
Type:PROTEIN
Mol. Mass.:65229.15
Organism:Human immunodeficiency virus 1
Description:ChEMBL_1473730
Residue:566
BDBM50036550
NameBDBM50036550
Synonyms:9-Isopropyl-7-(2-methyl-allyl)-6,7,8,9-tetrahydro-2H-2,7,9a-triaza-benzo[cd]azulen-1-one | CHEMBL69775
TypeSmall organic molecule
Emp. Form.C17H23N3O
Mol. Mass.285.384
SMILESCC(C)C1CN(CC(C)=C)Cc2cccc3[nH]c(=O)n1c23