Reaction Details
TargetReverse transcriptase/RNaseH
LigandBDBM1433
Substrate/Competitorn/a
Meas. Tech.ChEMBL_195535 (CHEMBL800982)
IC50 97±n/a nM
Citation Silverman, BDPlatt, DE Comparative molecular moment analysis (CoMMA): 3D-QSAR without molecular superposition. J Med Chem39:2129-40 (1996) 
 
Reverse transcriptase/RNaseH
Name:Reverse transcriptase/RNaseH
Type:PROTEIN
Mol. Mass.:65229.15
Organism:Human immunodeficiency virus 1
Description:ChEMBL_1473730
Residue:566
BDBM1433
NameBDBM1433
Synonyms:(11S)-11-methyl-10-(3-methylbut-2-en-1-yl)-1,3,10-triazatricyclo[6.4.1.0^{4,13}]trideca-4(13),5,7-triene-2-thione TIBO
TypeSmall organic molecule
Emp. Form.C16H21N3S
Mol. Mass.287.423
SMILESC[C@H]1Cn2c3c(CN1CC=C(C)C)cccc3[nH]c2=S