Reaction Details
TargetSubstance-P receptor
LigandBDBM50407836
Substrate/Competitorn/a
Meas. Tech.ChEMBL_205734 (CHEMBL809501)
IC50 2±n/a nM
Citation Hirschmann, RYao, WCascieri, MAStrader, CDMaechler, LCichy-Knight, MAHynes, Jvan Rijn, RDSprengeler, PASmith, AB Synthesis of potent cyclic hexapeptide NK-1 antagonists. Use of a minilibrary in transforming a peptidal somatostatin receptor ligand into an NK-1 receptor ligand via a polyvalent peptidomimetic. J Med Chem39:2441-8 (1996) 
 
Substance-P receptor
Name:Substance-P receptor
Type:G Protein-Coupled Receptor (GPCR)
Mol. Mass.:46254.43
Organism:Homo sapiens (Human)
Description:P25103
Residue:407
BDBM50407836
NameBDBM50407836
Synonyms:CHEMBL2112240
TypeSmall organic molecule
Emp. Form.C51H52FN7O7
Mol. Mass.893.9997
SMILESC[C@@H](O)[C@@H]1NC(=O)[C@H](Cc2ccc(F)cc2)NC(=O)[C@@H](Cc2c[nH]c3ccccc23)NC(=O)[C@H](Cc2cccc3ccccc23)NC(=O)[C@@H]2CCCN2C(=O)[C@H](Cc2ccccc2)NC1=O