Reaction Details
TargetBeta-2 adrenergic receptor
LigandBDBM50051567
Substrate/Competitorn/a
Meas. Tech.ChEMBL_38305 (CHEMBL647109)
IC50 3000±n/a nM
Citation Hirschmann, RYao, WCascieri, MAStrader, CDMaechler, LCichy-Knight, MAHynes, Jvan Rijn, RDSprengeler, PASmith, AB Synthesis of potent cyclic hexapeptide NK-1 antagonists. Use of a minilibrary in transforming a peptidal somatostatin receptor ligand into an NK-1 receptor ligand via a polyvalent peptidomimetic. J Med Chem39:2441-8 (1996) 
 
Beta-2 adrenergic receptor
Name:Beta-2 adrenergic receptor
Type:n/a
Mol. Mass.:46461.69
Organism:Homo sapiens (Human)
Description:P07550
Residue:413
BDBM50051567
NameBDBM50051567
Synonyms:5-{(2R,3R,4S,5R,6R)-3,4,5-Tris-benzyloxy-6-[2-(1H-indol-3-yl)-ethoxy]-tetrahydro-pyran-2-ylmethoxy}-pentylamine CHEMBL282618
TypeSmall organic molecule
Emp. Form.C42H50N2O6
Mol. Mass.678.8562
SMILESNCCCCCOC[C@H]1O[C@@H](OCCc2c[nH]c3ccccc23)[C@H](OCc2ccccc2)[C@@H](OCc2ccccc2)[C@@H]1OCc1ccccc1