Reaction Details
TargetNeprilysin
LigandBDBM50051784
Substrate/Competitorn/a
Meas. Tech.ChEMBL_144459 (CHEMBL755106)
IC50 1±n/a nM
Citation Fournie-Zaluski, MCCoric, PThery, VGonzalez, WMeudal, HTurcaud, SMichel, JBRoques, BP Design of orally active dual inhibitors of neutral endopeptidase and angiotensin-converting enzyme with long duration of action. J Med Chem39:2594-608 (1996) 
 
Neprilysin
Name:Neprilysin
Type:Enzyme
Mol. Mass.:85570.75
Organism:Oryctolagus cuniculus (rabbit)
Description:NEP was purified to homogeneity from rabbit kidney.
Residue:750
BDBM50051784
NameBDBM50051784
Synonyms:(2S,5R)-5-(2-Hydroxy-phenyl)-1-[2-((S)-2-mercapto-3-phenyl-propionylamino)-acetyl]-pyrrolidine-2-carboxylic acid | CHEMBL329125
TypeSmall organic molecule
Emp. Form.C22H24N2O5S
Mol. Mass.428.501
SMILESOC(=O)[C@@H]1CC[C@@H](N1C(=O)CNC(=O)[C@@H](S)Cc1ccccc1)c1ccccc1O