Reaction Details
TargetLeukotriene B4 receptor 1
LigandBDBM50029464
Substrate/Competitorn/a
Meas. Tech.ChEMBL_99834 (CHEMBL709863)
Ki 0.47±n/a nM
Citation Brooks, CDSummers, JB Modulators of leukotriene biosynthesis and receptor activation. J Med Chem39:2629-54 (1996) 
 
Leukotriene B4 receptor 1
Name:Leukotriene B4 receptor 1
Type:Enzyme Catalytic Domain
Mol. Mass.:37582.68
Organism:Homo sapiens (Human)
Description:Q15722
Residue:352
BDBM50029464
NameBDBM50029464
Synonyms:5-(2-Carboxy-ethyl)-6-[3-(5-ethyl-4'-fluoro-2-hydroxy-biphenyl-4-yloxy)-propoxy]-9-oxo-9H-xanthene-2-carboxylic acid LY-292728
TypeSmall organic molecule
Emp. Form.C34H29FO9
Mol. Mass.600.5871
SMILESCCc1cc(c(O)cc1OCCCOc1ccc2c(oc3ccc(cc3c2=O)C(O)=O)c1CCC(O)=O)-c1ccc(F)cc1