Reaction Details
TargetLeukotriene B4 receptor 1
LigandBDBM50001611
Substrate/Competitorn/a
Meas. Tech.ChEMBL_99647 (CHEMBL709305)
IC50 13±n/a nM
Citation Brooks, CDSummers, JB Modulators of leukotriene biosynthesis and receptor activation. J Med Chem39:2629-54 (1996) 
 
Leukotriene B4 receptor 1
Name:Leukotriene B4 receptor 1
Type:Enzyme Catalytic Domain
Mol. Mass.:37582.68
Organism:Homo sapiens (Human)
Description:Q15722
Residue:352
BDBM50001611
NameBDBM50001611
Synonyms:(E)-3-{3-(2-Carboxy-ethyl)-4-[6-(4-methoxy-phenyl)-hex-5-enyloxy]-benzoyl}-benzoic acid 3-{3-(2-Carboxy-ethyl)-4-[(E)-6-(4-methoxy-phenyl)-hex-5-enyloxy]-benzoyl}-benzoic acid 3-{3-(2-Carboxy-ethyl)-4-[6-(4-methoxy-phenyl)-hex-5-enyloxy]-benzoyl}-benzoic acid (BT223982) CHEMBL49302 | LY-223982
TypeSmall organic molecule
Emp. Form.C30H30O7
Mol. Mass.502.555
SMILESCOc1ccc(\C=C\CCCCOc2ccc(cc2CCC(O)=O)C(=O)c2cccc(c2)C(O)=O)cc1