Reaction Details
TargetSodium-dependent dopamine transporter
LigandBDBM50052176
Substrate/Competitorn/a
Meas. Tech.ChEMBL_62327 (CHEMBL674266)
Ki 2.1±n/a nM
Citation Kotian, PMascarella, SWAbraham, PLewin, AHBoja, JWKuhar, MJCarroll, FI Synthesis, ligand binding, and quantitative structure-activity relationship study of 3 beta-(4'-substituted phenyl)-2 beta-heterocyclic tropanes: evidence for an electrostatic interaction at the 2 beta-position. J Med Chem39:2753-63 (1996) 
 
Sodium-dependent dopamine transporter
Name:Sodium-dependent dopamine transporter
Type:Multi-pass membrane protein
Mol. Mass.:68749.45
Organism:Rattus norvegicus (rat)
Description:P23977
Residue:619
BDBM50052176
NameBDBM50052176
Synonyms:(2S,5R)-3-(4-Chloro-phenyl)-8-methyl-2-(3-phenyl-isoxazol-5-yl)-8-aza-bicyclo[3.2.1]octane | CHEMBL92610
TypeSmall organic molecule
Emp. Form.C23H23ClN2O
Mol. Mass.378.895
SMILESCN1[C@@H]2CCC1[C@H](C(C2)c1ccc(Cl)cc1)c1cc(no1)-c1ccccc1