Reaction Details
TargetVoltage-dependent L-type calcium channel subunit alpha-1C
LigandBDBM50052311
Substrate/Competitorn/a
Meas. Tech.ChEMBL_42932 (CHEMBL876248)
IC50 12±n/a nM
Citation Campiani, GFiorini, IDe Filippis, MPCiani, SMGarofalo, ANacci, VGiorgi, GSega, ABotta, MChiarini, ABudriesi, RBruni, GRomeo, MRManzoni, CMennini, T Cardiovascular characterization of pyrrolo[2,1-d][1,5]benzothiazepine derivatives binding selectively to the peripheral-type benzodiazepine receptor (PBR): from dual PBR affinity and calcium antagonist activity to novel and selective calcium entry blockers. J Med Chem39:2922-38 (1996) 
 
Voltage-dependent L-type calcium channel subunit alpha-1C
Name:Voltage-dependent L-type calcium channel subunit alpha-1C
Type:Enzyme Catalytic Domain
Mol. Mass.:243492.26
Organism:RAT
Description:Calcium channel 0 RAT::P22002
Residue:2169
BDBM50052311
NameBDBM50052311
Synonyms:Acetic acid (4R,5R)-7-chloro-1-dimethylaminomethyl-5-phenyl-4,5-dihydro-6-thia-10b-aza-benzo[e]azulen-4-yl ester | CHEMBL100709
TypeSmall organic molecule
Emp. Form.C23H23ClN2O2S
Mol. Mass.426.959
SMILESCN(C)Cc1ccc2[C@@H](OC(C)=O)[C@H](Sc3c(Cl)cccc3-n12)c1ccccc1