Reaction Details
TargetAdenosine receptor A3
LigandBDBM50035800
Substrate/Competitorn/a
Meas. Tech.ChEMBL_30485 (CHEMBL641437)
Ki 6200±n/a nM
Citation van Rhee, AMJiang, JLMelman, NOlah, MEStiles, GLJacobson, KA Interaction of 1,4-dihydropyridine and pyridine derivatives with adenosine receptors: selectivity for A3 receptors. J Med Chem39:2980-9 (1996) 
 
Adenosine receptor A3
Name:Adenosine receptor A3
Type:PROTEIN
Mol. Mass.:36643.73
Organism:Rattus norvegicus
Description:ChEMBL_479910
Residue:320
BDBM50035800
NameBDBM50035800
Synonyms:(S)-2,6-Dimethyl-5-nitro-4-(2-trifluoromethyl-phenyl)-1,4-dihydro-pyridine-3-carboxylic acid methyl ester CHEMBL283013
TypeSmall organic molecule
Emp. Form.C16H15F3N2O4
Mol. Mass.356.2965
SMILESCOC(=[OH+])C1=C(C)[N-]C(C)=C(C1c1ccccc1C(F)(F)F)[N+]([O-])=O