Reaction Details
TargetAdenosine receptor A1
LigandBDBM50035800
Substrate/Competitorn/a
Meas. Tech.ChEMBL_28835 (CHEMBL649101)
Ki 6660±n/a nM
Citation van Rhee, AMJiang, JLMelman, NOlah, MEStiles, GLJacobson, KA Interaction of 1,4-dihydropyridine and pyridine derivatives with adenosine receptors: selectivity for A3 receptors. J Med Chem39:2980-9 (1996) 
 
Adenosine receptor A1
Name:Adenosine receptor A1
Type:Protein
Mol. Mass.:36704.13
Organism:Rattus norvegicus (rat)
Description:n/a
Residue:326
BDBM50035800
NameBDBM50035800
Synonyms:(S)-2,6-Dimethyl-5-nitro-4-(2-trifluoromethyl-phenyl)-1,4-dihydro-pyridine-3-carboxylic acid methyl ester CHEMBL283013
TypeSmall organic molecule
Emp. Form.C16H15F3N2O4
Mol. Mass.356.2965
SMILESCOC(=[OH+])C1=C(C)[N-]C(C)=C(C1c1ccccc1C(F)(F)F)[N+]([O-])=O