Reaction Details
TargetAdenosine receptor A2a
LigandBDBM85775
Substrate/Competitorn/a
Meas. Tech.ChEMBL_30917 (CHEMBL647261)
Ki 4770±n/a nM
Citation van Rhee, AMJiang, JLMelman, NOlah, MEStiles, GLJacobson, KA Interaction of 1,4-dihydropyridine and pyridine derivatives with adenosine receptors: selectivity for A3 receptors. J Med Chem39:2980-9 (1996) 
 
Adenosine receptor A2a
Name:Adenosine receptor A2a
Type:G Protein-Coupled Receptor (GPCR)
Mol. Mass.:45015.65
Organism:Rattus norvegicus (rat)
Description:Rat A2A receptors expressed in CHO cells.
Residue:410
BDBM85775
NameBDBM85775
Synonyms:CHEMBL315984 | MRS1097
TypeSmall organic molecule
Emp. Form.C26H27NO4
Mol. Mass.417.4969
SMILESCCOC(=O)C1C(\C=C\c2ccccc2)C(C(=O)OCC)=C(N=C1C)c1ccccc1