Reaction Details
TargetSerine protease 1
LigandBDBM50052418
Substrate/Competitorn/a
Meas. Tech.ChEMBL_212531 (CHEMBL815751)
Ki 1.6±n/a nM
Citation Costanzo, MJMaryanoff, BEHecker, LRSchott, MRYabut, SCZhang, HCAndrade-Gordon, PKauffman, JALewis, JMKrishnan, RTulinsky, A Potent thrombin inhibitors that probe the S1 subsite: tripeptide transition state analogues based on a heterocycle-activated carbonyl group. J Med Chem39:3039-43 (1996) 
 
Serine protease 1
Name:Serine protease 1
Type:Enzyme
Mol. Mass.:25790.52
Organism:Bos taurus (bovine)
Description:P00760
Residue:246
BDBM50052418
NameBDBM50052418
Synonyms:(S)-1-((R)-2-Methylamino-3-phenyl-propionyl)-pyrrolidine-2-carboxylic acid [(S)-4-guanidino-1-(thiazole-2-carbonyl)-butyl]-amide CHEMBL322205
TypeSmall organic molecule
Emp. Form.C24H33N7O3S
Mol. Mass.499.629
SMILESCN[C@H](Cc1ccccc1)C(=O)N1CCC[C@H]1C(=O)N[C@@H](CCCNC(N)=N)C(=O)c1nccs1