Reaction Details
TargetTransient receptor potential cation channel subfamily V member 1
LigandBDBM50052440
Substrate/Competitorn/a
Meas. Tech.ChEMBL_215636 (CHEMBL820954)
Ki 600±n/a nM
Citation Appendino, GCravotto, GPalmisano, GAnnunziata, RSzallasi, A Synthesis and evaluation of phorboid 20-homovanillates: discovery of a class of ligands binding to the vanilloid (capsaicin) receptor with different degrees of cooperativity. J Med Chem39:3123-31 (1996) 
 
Transient receptor potential cation channel subfamily V member 1
Name:Transient receptor potential cation channel subfamily V member 1
Type:Transient Receptor
Mol. Mass.:94956.12
Organism:Rattus norvegicus (rat)
Description:O35433
Residue:838
BDBM50052440
NameBDBM50052440
Synonyms:CHEMBL104647 | Phenyl-acetic acid (1aR,1bS,4aR,7aS,7bS,8R,9R,9aS)-9a-acetoxy-4a,7b-dihydroxy-3-[2-(4-hydroxy-3-methoxy-phenyl)-acetoxymethyl]-1,1,6,8-tetramethyl-5-oxo-1a,1b,4,4a,5,7a,7b,8,9,9a-decahydro-1H-cyclopropa[3,4]benzo[1,2-e]azulen-9-yl ester
TypeSmall organic molecule
Emp. Form.C39H44O11
Mol. Mass.688.7601
SMILESCOc1cc(CC(=O)OCC2=C[C@H]3[C@@H]4C(C)(C)[C@]4(OC(C)=O)[C@H](OC(=O)Cc4ccccc4)[C@@H](C)[C@]3(O)[C@@H]3C=C(C)C(=O)[C@@]3(O)C2)ccc1O