Reaction Details
TargetTranslocator protein
LigandBDBM50052744
Substrate/Competitorn/a
Meas. Tech.ChEMBL_37054 (CHEMBL652443)
Ki 2.8±n/a nM
Citation Campiani, GNacci, VFiorini, IDe Filippis, MPGarofalo, ACiani, SMGreco, GNovellino, EWilliams, DCZisterer, DMWoods, MJMihai, CManzoni, CMennini, T Synthesis, biological activity, and SARs of pyrrolobenzoxazepine derivatives, a new class of specific"peripheral-type" benzodiazepine receptor ligands. J Med Chem39:3435-50 (1996) 
 
Translocator protein
Name:Translocator protein
Type:Mitochondrion membrane protein
Mol. Mass.:18945.84
Organism:Rattus norvegicus (rat)
Description:Competitive binding experiments were performed on rat kidney mitochondrial membranes.
Residue:169
BDBM50052744
NameBDBM50052744
Synonyms:Acetic acid 5-p-tolyl-6-oxa-10b-aza-benzo[e]azulen-4-yl ester | CHEMBL326772
TypeSmall organic molecule
Emp. Form.C21H17NO3
Mol. Mass.331.3646
SMILESCC(=O)OC1=C(Oc2ccccc2-n2cccc12)c1ccc(C)cc1