Reaction Details
TargetTranslocator protein
LigandBDBM50038256
Substrate/Competitorn/a
Meas. Tech.ChEMBL_37055 (CHEMBL652444)
Ki 2.6±n/a nM
Citation Campiani, GNacci, VFiorini, IDe Filippis, MPGarofalo, ACiani, SMGreco, GNovellino, EWilliams, DCZisterer, DMWoods, MJMihai, CManzoni, CMennini, T Synthesis, biological activity, and SARs of pyrrolobenzoxazepine derivatives, a new class of specific"peripheral-type" benzodiazepine receptor ligands. J Med Chem39:3435-50 (1996) 
 
Translocator protein
Name:Translocator protein
Type:Mitochondrion membrane protein
Mol. Mass.:18945.84
Organism:Rattus norvegicus (rat)
Description:Competitive binding experiments were performed on rat kidney mitochondrial membranes.
Residue:169
BDBM50038256
NameBDBM50038256
Synonyms:CHEMBL117589 | Dimethyl-carbamic acid 7-chloro-5-phenyl-6-thia-10b-aza-benzo[e]azulen-4-yl ester
TypeSmall organic molecule
Emp. Form.C21H17ClN2O2S
Mol. Mass.396.89
SMILESCN(C)C(=O)OC1=C(Sc2c(Cl)cccc2-n2cccc12)c1ccccc1