Reaction Details
TargetTranslocator protein
LigandBDBM50052758
Substrate/Competitorn/a
Meas. Tech.ChEMBL_37061 (CHEMBL652449)
Ki 25±n/a nM
Citation Campiani, GNacci, VFiorini, IDe Filippis, MPGarofalo, ACiani, SMGreco, GNovellino, EWilliams, DCZisterer, DMWoods, MJMihai, CManzoni, CMennini, T Synthesis, biological activity, and SARs of pyrrolobenzoxazepine derivatives, a new class of specific"peripheral-type" benzodiazepine receptor ligands. J Med Chem39:3435-50 (1996) 
 
Translocator protein
Name:Translocator protein
Type:Mitochondrion membrane protein
Mol. Mass.:18945.84
Organism:Rattus norvegicus (rat)
Description:Competitive binding experiments were performed on rat kidney mitochondrial membranes.
Residue:169
BDBM50052758
NameBDBM50052758
Synonyms:1-(5-Phenyl-6-oxa-10b-aza-benzo[e]azulen-4-yl)-ethanone | CHEMBL323793
TypeSmall organic molecule
Emp. Form.C20H15NO2
Mol. Mass.301.3386
SMILESCC(=O)C1=C(Oc2ccccc2-n2cccc12)c1ccccc1