Reaction Details
TargetTranslocator protein
LigandBDBM50052749
Substrate/Competitorn/a
Meas. Tech.ChEMBL_37061 (CHEMBL652449)
Ki 0.36±n/a nM
Citation Campiani, GNacci, VFiorini, IDe Filippis, MPGarofalo, ACiani, SMGreco, GNovellino, EWilliams, DCZisterer, DMWoods, MJMihai, CManzoni, CMennini, T Synthesis, biological activity, and SARs of pyrrolobenzoxazepine derivatives, a new class of specific"peripheral-type" benzodiazepine receptor ligands. J Med Chem39:3435-50 (1996) 
 
Translocator protein
Name:Translocator protein
Type:Mitochondrion membrane protein
Mol. Mass.:18945.84
Organism:Rattus norvegicus (rat)
Description:Competitive binding experiments were performed on rat kidney mitochondrial membranes.
Residue:169
BDBM50052749
NameBDBM50052749
Synonyms:CHEMBL325025 | Diethyl-carbamic acid 5-p-tolyl-6-oxa-10b-aza-benzo[e]azulen-4-yl ester
TypeSmall organic molecule
Emp. Form.C24H24N2O3
Mol. Mass.388.459
SMILESCCN(CC)C(=O)OC1=C(Oc2ccccc2-n2cccc12)c1ccc(C)cc1