Reaction Details
TargetPenicillin-binding protein 1B
LigandBDBM50053180
Substrate/Competitorn/a
Meas. Tech.ChEMBL_153527 (CHEMBL763467)
IC50>10000000±n/a nM
Citation Richter, HGAngehrn, PHubschwerlen, CKania, MPage, MGSpecklin, JLWinkler, FK Design, synthesis, and evaluation of 2 beta-alkenyl penam sulfone acids as inhibitors of beta-lactamases. J Med Chem39:3712-22 (1996) 
 
Penicillin-binding protein 1B
Name:Penicillin-binding protein 1B
Type:PROTEIN
Mol. Mass.:94304.04
Organism:Escherichia coli (strain K12)
Description:ChEMBL_153527
Residue:844
BDBM50053180
NameBDBM50053180
Synonyms:CHEMBL332565 | Sodium; (2S,3S,5R)-3-methyl-4,4,7-trioxo-3-((Z)-2-thiazol-5-yl-vinyl)-4lambda*6*-thia-1-aza-bicyclo[3.2.0]heptane-2-carboxylate
TypeSmall organic molecule
Emp. Form.C12H11N2O5S2
Mol. Mass.327.357
SMILESC[C@]1(\C=C/c2cncs2)[C@@H](N2[C@@H](CC2=O)S1(=O)=O)C([O-])=O