Reaction Details
TargetBeta-lactamase
LigandBDBM50053181
Substrate/Competitorn/a
Meas. Tech.ChEMBL_40245 (CHEMBL654925)
IC50 2900±n/a nM
Citation Richter, HGAngehrn, PHubschwerlen, CKania, MPage, MGSpecklin, JLWinkler, FK Design, synthesis, and evaluation of 2 beta-alkenyl penam sulfone acids as inhibitors of beta-lactamases. J Med Chem39:3712-22 (1996) 
 
Beta-lactamase
Name:Beta-lactamase
Type:PROTEIN
Mol. Mass.:33993.80
Organism:Bacillus licheniformis
Description:ChEMBL_571690
Residue:307
BDBM50053181
NameBDBM50053181
Synonyms:(2S,3S,5R)-3-((Z)-2-Ethoxycarbonyl-vinyl)-3-methyl-4,4,7-trioxo-4lambda*6*-thia-1-aza-bicyclo[3.2.0]heptane-2-carboxylic acid | CHEMBL122209
TypeSmall organic molecule
Emp. Form.C12H15NO7S
Mol. Mass.317.315
SMILESCCOC(=O)\C=C/[C@@]1(C)[C@@H](N2[C@@H](CC2=O)S1(=O)=O)C(O)=O