Reaction Details
TargetCannabinoid receptor 1
LigandBDBM50053267
Substrate/Competitorn/a
Meas. Tech.ChEMBL_46806 (CHEMBL659693)
Ki 5.8±n/a nM
Citation Busch-Petersen, JHill, WAFan, PKhanolkar, AXie, XQTius, MAMakriyannis, A Unsaturated side chain beta-11-hydroxyhexahydrocannabinol analogs. J Med Chem39:3790-6 (1996) 
 
Cannabinoid receptor 1
Name:Cannabinoid receptor 1
Type:G Protein-Coupled Receptor (GPCR)
Mol. Mass.:52856.55
Organism:Rattus norvegicus (rat)
Description:P20272
Residue:473
BDBM50053267
NameBDBM50053267
Synonyms:(6aR,9R,10aR)-3-Hept-1-ynyl-9-hydroxymethyl-6,6-dimethyl-6a,7,8,9,10,10a-hexahydro-6H-benzo[c]chromen-1-ol | CHEMBL341511
TypeSmall organic molecule
Emp. Form.C23H32O3
Mol. Mass.356.4984
SMILESCCCCCC#Cc1cc(O)c2[C@@H]3C[C@H](CO)CC[C@H]3C(C)(C)Oc2c1